{"text_format":"1","workbook":"xlsx","n_sheets":2,"sheets":["Naudas plūsma 1. gads","Naudas plūsma 2. gads"],"not_rendered":{"charts":0,"images":1,"macros":1,"external_links":0,"defined_names":2,"comments":0,"pivot_tables":0},"unopened":[],"bounds":{"document_bytes":16777216,"sheet_cells":100000,"rows_first":2000,"rows_last":500,"rows_between":2000,"halvings":0,"cell_chars":16384,"cell_head_chars":4096},"cells_cut":0,"cells_raw":0,"read":"whole","date_system":"1900"}

{"sheet":"Naudas plūsma 1. gads","index":0,"n_rows":87,"n_cols":39,"rows_kept":87,"cut":false,"hidden":false,"merged":[[86,12,86,13],[71,3,71,4],[79,3,79,4],[74,3,74,4],[86,15,86,16],[85,15,85,16],[86,7,86,10],[85,7,85,10],[78,3,78,4],[77,3,77,4],[85,12,85,13],[73,3,73,4],[85,2,86,4],[80,3,80,4],[72,3,72,4],[2,2,2,3],[2,5,2,7],[3,5,3,7],[75,3,75,4],[76,3,76,4],[70,3,70,4]]}
[null,null,null,null,null,null,null,null,null,null,null,null,null,null,null,null,null,null,null,null,null,null,null,null,null,1,null,1]
[null,null,null,null,null,null,null,null,null,null,null,null,null,null,null,null,null,null,"Naudas plūsma (JP) 1. gads",null,null,2,null,null,null,null,null,1,"LVL",1,{"$f":"\"A\"&AM55","v":"A7"},null,null,null,null,null,null,1,7]
[null,null,null,null,null,null,null,null,null,null,null,null,null,null,null,null,null,null,null,null,null,1,null,null,null,null,null,null,"EUR"]
[null,null,null,"Aizņēmēja nosaukums / Vārds, uzvārds",null,"Reģistrācijas Nr. / personas kods"]
[null,null,"Ieņēmumi, EUR"]
[null,null,null,null,"Naudas plūsmas sākuma mēnesis",{"$f":"AE57","v":"okt"},{"$f":"AE58","v":"nov"},{"$f":"AE59","v":"dec"},{"$f":"AE60","v":"jan"},{"$f":"AE61","v":"feb"},{"$f":"AE62","v":"mar"},{"$f":"AE63","v":"apr"},{"$f":"AE64","v":"mai"},{"$f":"AE65","v":"jūn"},{"$f":"AE66","v":"jūl"},{"$f":"AE67","v":"aug"},{"$f":"AE68","v":"sep"},null,"Kopā",null,null,null,null,null,null,null,null,null,null,"$A$32",null,null,null,null,null,null,null,2,8]
[null,null,null,null,"Bilance perioda sakuma",null,{"$f":"F85","v":0},{"$f":"G85","v":0},0,0,0,0,0,0,0,0,0,null,null,null,null,null,null,null,null,null,null,null,null,null,null,null,null,null,null,null,null,3,9]
[null,null,null,null,"PVN likme",null,null,null,null,null,null,null,null,null,null,null,null,null,null,null,null,null,null,null,null,null,null,null,null,null,null,null,null,null,null,null,null,4,10]
[null,null,null,"Ieņēmumi, kas saņemti no debitoru parādu atgūšanas",0,null,null,null,null,null,null,null,null,null,null,null,null,null,{"$f":"SUM(F9:Q9)","v":0},null,null,null,null,null,null,null,null,null,null,null,null,null,null,null,null,null,null,5,11]
[null,null,null,"Ieņēmumi no krājumu pārdošanas",0.21,null,null,null,null,null,null,null,null,null,null,null,null,null,0,null,null,null,null,null,null,null,null,null,null,null,null,null,null,null,null,null,null,6,12]
[null,null,null,null,"Kopā",{"$f":"SUM(F9:F10)","v":0},{"$f":"SUM(G9:G10)","v":0},0,0,0,0,0,0,0,0,0,0]
[null,null,null,"Pamatdarbības"]
[null,null,null,null,0.21,null,null,null,null,null,null,null,null,null,null,null,null,null,0,null,null,null,null,null,null,null,null,null,null,null,null,null,null,null,null,null,null,7,13]
[null,null,null,null,0.21,null,null,null,null,null,null,null,null,null,null,null,null,null,0,null,null,null,null,null,null,null,null,null,null,null,null,null,null,null,null,null,null,8,14]
[null,null,null,null,0.21,null,null,null,null,null,null,null,null,null,null,null,null,null,0,null,null,null,null,null,null,null,null,null,null,null,null,null,null,null,null,null,null,9,15]
[null,null,null,null,0.21,null,null,null,null,null,null,null,null,null,null,null,null,null,0,null,null,null,null,null,null,null,null,null,null,null,null,null,null,null,null,null,null,10,16]
[null,null,null,null,0.21,null,null,null,null,null,null,null,null,null,null,null,null,null,0,null,null,null,null,null,null,null,null,null,null,null,null,null,null,null,null,null,null,11,17]
[null,null,null,null,0.21,null,null,null,null,null,null,null,null,null,null,null,null,null,0,null,null,null,null,null,null,null,null,null,null,null,null,null,null,null,null,null,null,12,22]
[null,null,null,null,0.21,null,null,null,null,null,null,null,null,null,null,null,null,null,0,null,null,null,null,null,null,null,null,null,null,null,null,null,null,null,null,null,null,13,23]
[null,null,null,null,0.21,null,null,null,null,null,null,null,null,null,null,null,null,null,0,null,null,null,null,null,null,null,null,null,null,null,null,null,null,null,null,null,null,14,28]
[null,null,null,null,0.21,null,null,null,null,null,null,null,null,null,null,null,null,null,0,null,null,null,null,null,null,null,null,null,null,null,null,null,null,null,null,null,null,15,29]
[null,null,null,null,0.21,null,null,null,null,null,null,null,null,null,null,null,null,null,0,null,null,null,null,null,null,null,null,null,null,null,null,null,null,null,null,null,null,16,30]
[null,null,null,null,0.21,null,null,null,null,null,null,null,null,null,null,null,null,null,0,null,null,null,null,null,null,null,null,null,null,null,null,null,null,null,null,null,null,17,31]
[null,null,null,null,"Kopā",{"$f":"SUM(F13:F23)","v":0},{"$f":"SUM(G13:G23)","v":0},0,0,0,0,0,0,0,0,0,0,null,{"$f":"SUM(S13:S23)","v":0},null,null,null,null,null,null,null,null,null,null,2,{"$f":"AD24-1","v":1},null,2,{"$f":"AG24-1","v":1},null,null,null,18,32]
[null,null,null,"Citi ieņēmumi"]
[null,null,null,"Saņemtie īstermiņa Aizdevēja* aizdevumi",0,null,null,null,null,null,null,null,null,null,null,null,null,null,{"$f":"SUM(F26:Q26)","v":0},null,null,null,null,null,null,null,null,null,"INV NOBĪDE",null,null,"AL NOBĪDE",null,null,null,null,null,19,33]
[null,null,null,"Saņemtie ilgtermiņa Aizdevēja* aizdevumi",0,null,null,null,null,null,null,null,null,null,null,null,null,null,{"$f":"SUM(F27:Q27)","v":0},null,null,null,null,null,null,null,null,1,{"$f":"IF(AE24>=$AB$27,0,$AB$27)","v":0},{"$f":"IF(AC27=0,0,LOOKUP(AC27,$AB$27:$AB$53,#REF!))","v":0},{"$f":"IF(AC27=0,0,LOOKUP(AC27,$AB$27:$AB$53,#REF!))","v":0},{"$f":"IF($AH$24>=AB27,0,AB27)","v":0},{"$f":"IF($AF$27=0,0,LOOKUP($AF$27,$AB$27:$AB$53,#REF!))","v":0},{"$f":"IF(AF27=0,0,LOOKUP(AF27,$AB$27:$AB$53,#REF!))","v":0},null,null,null,20,34]
[null,null,null,"Ārkārtas ieņēmumi",0.21,null,null,null,null,null,null,null,null,null,null,null,null,null,0,null,null,null,null,null,null,null,null,2,{"$f":"IF($AE$24>=AB28,0,AC27+1)","v":1},{"$f":"IF(AC28=0,0,LOOKUP(AC28,$AB$27:$AB$53,#REF!))","v":{"$error":"#REF!"}},{"$f":"IF(AC28=0,0,LOOKUP(AC28,$AB$27:$AB$53,#REF!))","v":{"$error":"#REF!"}},{"$f":"IF($AH$24>=AB28,0,AF27+1)","v":1},{"$f":"IF(AF28=0,0,LOOKUP(AF28,$AB$27:$AB$53,#REF!))","v":{"$error":"#REF!"}},{"$f":"IF(AF28=0,0,LOOKUP(AF28,$AB$27:$AB$53,#REF!))","v":{"$error":"#REF!"}},null,null,null,21,35]
[null,null,null,null,0.21,null,null,null,null,null,null,null,null,null,null,null,null,null,0,null,null,null,null,null,null,null,null,3,2,{"$f":"IF(AC29=0,0,LOOKUP(AC29,$AB$27:$AB$53,#REF!))","v":{"$error":"#REF!"}},{"$f":"IF(AC29=0,0,LOOKUP(AC29,$AB$27:$AB$53,#REF!))","v":{"$error":"#REF!"}},2,{"$f":"IF(AF29=0,0,LOOKUP(AF29,$AB$27:$AB$53,#REF!))","v":{"$error":"#REF!"}},{"$f":"IF(AF29=0,0,LOOKUP(AF29,$AB$27:$AB$53,#REF!))","v":{"$error":"#REF!"}},null,null,null,22,36]
[null,null,null,null,0.21,null,null,null,null,null,null,null,null,null,null,null,null,null,0,null,null,null,null,null,null,null,null,4,3,{"$f":"IF(AC30=0,0,LOOKUP(AC30,$AB$27:$AB$53,#REF!))","v":{"$error":"#REF!"}},{"$f":"IF(AC30=0,0,LOOKUP(AC30,$AB$27:$AB$53,#REF!))","v":{"$error":"#REF!"}},3,{"$f":"IF(AF30=0,0,LOOKUP(AF30,$AB$27:$AB$53,#REF!))","v":{"$error":"#REF!"}},{"$f":"IF(AF30=0,0,LOOKUP(AF30,$AB$27:$AB$53,#REF!))","v":{"$error":"#REF!"}},null,null,null,23,37]
[null,null,null,null,"Saņemtais PVN",{"$f":"(F9*$E$9)+(F10*$E$10)+(F13*$E$13)+(F14*$E$14)+(F15*$E$15)+(F16*$E$16)+(F17*$E$17)+(F18*$E$18)+(F19*$E$19)+(F20*$E$20)+(F21*$E$21)+(F22*$E$22)+(F23*$E$23)+(F26*$E$26)+(F27*$E$27)+(F28*$E$28)+(F29*$E$29)+(F30*$E$30)","v":0},0,0,0,0,0,0,0,0,0,0,0,null,{"$f":"(S9*$E$9)+(S10*$E$10)+(S13*$E$13)+(S14*$E$14)+(S15*$E$15)+(S16*$E$16)+(S17*$E$17)+(S18*$E$18)+(S19*$E$19)+(S20*$E$20)+(S21*$E$21)+(S22*$E$22)+(S23*$E$23)+(S26*$E$26)+(S27*$E$27)+(S28*$E$28)+(S29*$E$29)+(S30*$E$30)","v":0},null,null,null,null,null,null,null,null,5,4,{"$f":"IF(AC31=0,0,LOOKUP(AC31,$AB$27:$AB$53,#REF!))","v":{"$error":"#REF!"}},{"$f":"IF(AC31=0,0,LOOKUP(AC31,$AB$27:$AB$53,#REF!))","v":{"$error":"#REF!"}},4,{"$f":"IF(AF31=0,0,LOOKUP(AF31,$AB$27:$AB$53,#REF!))","v":{"$error":"#REF!"}},{"$f":"IF(AF31=0,0,LOOKUP(AF31,$AB$27:$AB$53,#REF!))","v":{"$error":"#REF!"}},null,null,null,24,38]
[null,null,null,null,"Kopā ieņēmumi",{"$f":"SUM(F11)+F24+SUM(F26:F31)","v":0},{"$f":"SUM(G11)+G24+SUM(G26:G31)","v":0},0,0,0,0,0,0,0,0,0,0,null,{"$f":"SUM(S9:S10,S24,S26:S31)","v":0},null,null,null,null,null,null,null,null,6,5,{"$f":"IF(AC32=0,0,LOOKUP(AC32,$AB$27:$AB$53,#REF!))","v":{"$error":"#REF!"}},{"$f":"IF(AC32=0,0,LOOKUP(AC32,$AB$27:$AB$53,#REF!))","v":{"$error":"#REF!"}},5,{"$f":"IF(AF32=0,0,LOOKUP(AF32,$AB$27:$AB$53,#REF!))","v":{"$error":"#REF!"}},{"$f":"IF(AF32=0,0,LOOKUP(AF32,$AB$27:$AB$53,#REF!))","v":{"$error":"#REF!"}},null,null,null,25,39]
[null,null,"Izdevumi, EUR",null,null,null,null,null,null,null,null,null,null,null,null,null,null,null,null,null,null,null,null,null,null,null,null,7,6,{"$f":"IF(AC33=0,0,LOOKUP(AC33,$AB$27:$AB$53,#REF!))","v":{"$error":"#REF!"}},{"$f":"IF(AC33=0,0,LOOKUP(AC33,$AB$27:$AB$53,#REF!))","v":{"$error":"#REF!"}},6,{"$f":"IF(AF33=0,0,LOOKUP(AF33,$AB$27:$AB$53,#REF!))","v":{"$error":"#REF!"}},{"$f":"IF(AF33=0,0,LOOKUP(AF33,$AB$27:$AB$53,#REF!))","v":{"$error":"#REF!"}},null,null,null,26,40]
[null,null,null,"Mainīgās izmaksas",null,{"$f":"F6","v":"okt"},"nov","dec","jan","feb","mar","apr","mai","jūn","jūl","aug","sep",null,"Kopā"]
[null,null,null,"Gaidāmie maksājumi",0.21,null,null,null,null,null,null,null,null,null,null,null,null,null,{"$f":"SUM(F35:Q35)","v":0},null,null,null,null,null,null,null,null,8,{"$f":"IF($AE$24>=AB35,0,AC33+1)","v":7},{"$f":"IF(AC35=0,0,LOOKUP(AC35,$AB$27:$AB$53,#REF!))","v":{"$error":"#REF!"}},{"$f":"IF(AC35=0,0,LOOKUP(AC35,$AB$27:$AB$53,#REF!))","v":{"$error":"#REF!"}},{"$f":"IF($AH$24>=AB35,0,AF33+1)","v":7},{"$f":"IF(AF35=0,0,LOOKUP(AF35,$AB$27:$AB$53,#REF!))","v":{"$error":"#REF!"}},{"$f":"IF(AF35=0,0,LOOKUP(AF35,$AB$27:$AB$53,#REF!))","v":{"$error":"#REF!"}},null,null,null,27,42]
[]
[null,null,null,"Izejmateriāli",0.21,null,null,null,null,null,null,null,null,null,null,null,null,null,0,null,null,null,null,null,null,null,null,9,{"$f":"IF($AE$24>=AB37,0,AC35+1)","v":8},{"$f":"IF(AC37=0,0,LOOKUP(AC37,$AB$27:$AB$53,#REF!))","v":{"$error":"#REF!"}},{"$f":"IF(AC37=0,0,LOOKUP(AC37,$AB$27:$AB$53,#REF!))","v":{"$error":"#REF!"}},{"$f":"IF($AH$24>=AB37,0,AF35+1)","v":8},{"$f":"IF(AF37=0,0,LOOKUP(AF37,$AB$27:$AB$53,#REF!))","v":{"$error":"#REF!"}},{"$f":"IF(AF37=0,0,LOOKUP(AF37,$AB$27:$AB$53,#REF!))","v":{"$error":"#REF!"}},null,null,null,28,43]
[null,null,null,"Palīgmateriāli",0.21,null,null,null,null,null,null,null,null,null,null,null,null,null,0,null,null,null,null,null,null,null,null,10,9,{"$f":"IF(AC38=0,0,LOOKUP(AC38,$AB$27:$AB$53,#REF!))","v":{"$error":"#REF!"}},{"$f":"IF(AC38=0,0,LOOKUP(AC38,$AB$27:$AB$53,#REF!))","v":{"$error":"#REF!"}},9,{"$f":"IF(AF38=0,0,LOOKUP(AF38,$AB$27:$AB$53,#REF!))","v":{"$error":"#REF!"}},{"$f":"IF(AF38=0,0,LOOKUP(AF38,$AB$27:$AB$53,#REF!))","v":{"$error":"#REF!"}},null,null,null,29,44]
[null,null,null,"Ražošanā strādājošo darba alga un sociālais nodoklis",0,null,null,null,null,null,null,null,null,null,null,null,null,null,0,null,null,null,null,null,null,null,null,11,10,{"$f":"IF(AC39=0,0,LOOKUP(AC39,$AB$27:$AB$53,#REF!))","v":{"$error":"#REF!"}},{"$f":"IF(AC39=0,0,LOOKUP(AC39,$AB$27:$AB$53,#REF!))","v":{"$error":"#REF!"}},10,{"$f":"IF(AF39=0,0,LOOKUP(AF39,$AB$27:$AB$53,#REF!))","v":{"$error":"#REF!"}},{"$f":"IF(AF39=0,0,LOOKUP(AF39,$AB$27:$AB$53,#REF!))","v":{"$error":"#REF!"}},null,null,null,30,45]
[null,null,null,"Energoresursi",0.21,null,null,null,null,null,null,null,null,null,null,null,null,null,0,null,null,null,null,null,null,null,null,12,11,{"$f":"IF(AC40=0,0,LOOKUP(AC40,$AB$27:$AB$53,#REF!))","v":{"$error":"#REF!"}},{"$f":"IF(AC40=0,0,LOOKUP(AC40,$AB$27:$AB$53,#REF!))","v":{"$error":"#REF!"}},11,{"$f":"IF(AF40=0,0,LOOKUP(AF40,$AB$27:$AB$53,#REF!))","v":{"$error":"#REF!"}},{"$f":"IF(AF40=0,0,LOOKUP(AF40,$AB$27:$AB$53,#REF!))","v":{"$error":"#REF!"}},null,null,null,31,46]
{"$rows_left_out":48}
{"sheet":"Naudas plūsma 2. gads","index":1,"n_rows":86,"n_cols":41,"rows_kept":86,"cut":false,"hidden":false,"merged":[[71,2,71,3],[73,2,73,3],[69,2,69,3],[84,11,84,12],[84,14,84,15],[74,2,74,3],[75,2,75,3],[76,2,76,3],[70,2,70,3],[72,2,72,3],[85,6,85,9],[85,11,85,12],[85,14,85,15],[78,2,78,3],[77,2,77,3],[79,2,79,3],[84,6,84,9],[84,2,86,3]]}
[]
[null,null,null,null,null,null,null,null,null,null,null,null,null,null,null,null,null,"Naudas plūsma (JP) 2. gads",null,null,null,null,null,null,null,null,null,null,null,null,null,44,{"$f":"\"A\"&AO54","v":"A66"},null,null,null,null,null,null,1,7]
[null,{"$f":"IF('Naudas plūsma 1. gads'!$C$3=\"\",\"\",'Naudas plūsma 1. gads'!$C$3)","v":""}]
[null,"Ieņēmumi, EUR"]
[null,null,null,null,{"$f":"'Naudas plūsma 1. gads'!F6","v":"okt"},{"$f":"'Naudas plūsma 1. gads'!G6","v":"nov"},{"$f":"'Naudas plūsma 1. gads'!H6","v":"dec"},{"$f":"'Naudas plūsma 1. gads'!I6","v":"jan"},{"$f":"'Naudas plūsma 1. gads'!J6","v":"feb"},{"$f":"'Naudas plūsma 1. gads'!K6","v":"mar"},{"$f":"'Naudas plūsma 1. gads'!L6","v":"apr"},{"$f":"'Naudas plūsma 1. gads'!M6","v":"mai"},{"$f":"'Naudas plūsma 1. gads'!N6","v":"jūn"},{"$f":"'Naudas plūsma 1. gads'!O6","v":"jūl"},{"$f":"'Naudas plūsma 1. gads'!P6","v":"aug"},{"$f":"'Naudas plūsma 1. gads'!Q6","v":"sep"},null,"Kopā",null,null,null,null,null,null,null,null,null,null,null,null,null,"$H$35",null,null,null,null,null,null,null,2,8]
[null,null,null,null,{"$f":"'Naudas plūsma 1. gads'!Q85","v":0},{"$f":"E84","v":0},{"$f":"F84","v":0},0,0,0,0,0,0,0,0,0,null,null,null,null,null,null,null,null,null,null,null,null,null,null,null,null,null,null,null,null,null,null,null,3,9]
[null,null,null,"PVN likme",null,null,null,null,null,null,null,null,null,null,null,null,null,null,null,null,null,null,null,null,null,null,null,null,null,null,null,null,null,null,null,null,null,null,null,4,10]
[null,null,{"$f":"IF('Naudas plūsma 1. gads'!D9=\"\",\"\",'Naudas plūsma 1. gads'!D9)","v":"Ieņēmumi, kas saņemti no debitoru parādu atgūšanas"},{"$f":"'Naudas plūsma 1. gads'!E9","v":0},null,null,null,null,null,null,null,null,null,null,null,null,null,{"$f":"SUM(E8:P8)","v":0},null,null,null,null,null,null,null,null,null,null,null,null,null,null,null,null,null,null,null,null,null,5,11]
[null,null,{"$f":"IF('Naudas plūsma 1. gads'!D10=\"\",\"\",'Naudas plūsma 1. gads'!D10)","v":"Ieņēmumi no krājumu pārdošanas"},{"$f":"'Naudas plūsma 1. gads'!E10","v":0.21},null,null,null,null,null,null,null,null,null,null,null,null,null,0,null,null,null,null,null,null,null,null,null,null,null,null,null,null,null,null,null,null,null,null,null,6,12]
[null,null,null,"Kopā",{"$f":"SUM(E8:E9)","v":0},{"$f":"SUM(F8:F9)","v":0},0,0,0,0,0,0,0,0,0,0,null,{"$f":"SUM(R8:R9)","v":0}]
[null,null,"Pamatdarbības"]
[null,null,{"$f":"IF('Naudas plūsma 1. gads'!D13=\"\",\"\",'Naudas plūsma 1. gads'!D13)","v":""},{"$f":"'Naudas plūsma 1. gads'!E13","v":0.21},null,null,null,null,null,null,null,null,null,null,null,null,null,0,null,null,null,null,null,null,null,null,null,null,null,null,null,null,null,null,null,null,null,null,null,7,13]
[null,null,{"$f":"IF('Naudas plūsma 1. gads'!D14=\"\",\"\",'Naudas plūsma 1. gads'!D14)","v":""},{"$f":"'Naudas plūsma 1. gads'!E14","v":0.21},null,null,null,null,null,null,null,null,null,null,null,null,null,0,null,null,null,null,null,null,null,null,null,null,null,null,null,null,null,null,null,null,null,null,null,8,14]
[null,null,{"$f":"IF('Naudas plūsma 1. gads'!D15=\"\",\"\",'Naudas plūsma 1. gads'!D15)","v":""},{"$f":"'Naudas plūsma 1. gads'!E15","v":0.21},null,null,null,null,null,null,null,null,null,null,null,null,null,0,null,null,null,null,null,null,null,null,null,null,null,null,null,null,null,null,null,null,null,null,null,9,15]
[null,null,{"$f":"IF('Naudas plūsma 1. gads'!D16=\"\",\"\",'Naudas plūsma 1. gads'!D16)","v":""},{"$f":"'Naudas plūsma 1. gads'!E16","v":0.21},null,null,null,null,null,null,null,null,null,null,null,null,null,0,null,null,null,null,null,null,null,null,null,null,null,null,null,null,null,null,null,null,null,null,null,10,16]
[null,null,{"$f":"IF('Naudas plūsma 1. gads'!D17=\"\",\"\",'Naudas plūsma 1. gads'!D17)","v":""},{"$f":"'Naudas plūsma 1. gads'!E17","v":0.21},null,null,null,null,null,null,null,null,null,null,null,null,null,0,null,null,null,null,null,null,null,null,null,null,null,null,null,null,null,null,null,null,null,null,null,11,17]
[null,null,{"$f":"IF('Naudas plūsma 1. gads'!D18=\"\",\"\",'Naudas plūsma 1. gads'!D18)","v":""},{"$f":"'Naudas plūsma 1. gads'!E18","v":0.21},null,null,null,null,null,null,null,null,null,null,null,null,null,0,null,null,null,null,null,null,null,null,null,null,null,null,null,null,null,null,null,null,null,null,null,12,18]
[null,null,{"$f":"IF('Naudas plūsma 1. gads'!D19=\"\",\"\",'Naudas plūsma 1. gads'!D19)","v":""},{"$f":"'Naudas plūsma 1. gads'!E19","v":0.21},null,null,null,null,null,null,null,null,null,null,null,null,null,0,null,null,null,null,null,null,null,null,null,null,null,null,null,null,null,null,null,null,null,null,null,13,19]
[null,null,{"$f":"IF('Naudas plūsma 1. gads'!D20=\"\",\"\",'Naudas plūsma 1. gads'!D20)","v":""},{"$f":"'Naudas plūsma 1. gads'!E20","v":0.21},null,null,null,null,null,null,null,null,null,null,null,null,null,0,null,null,null,null,null,null,null,null,null,null,null,null,null,null,null,null,null,null,null,null,null,14,28]
[null,null,{"$f":"IF('Naudas plūsma 1. gads'!D21=\"\",\"\",'Naudas plūsma 1. gads'!D21)","v":""},{"$f":"'Naudas plūsma 1. gads'!E21","v":0.21},null,null,null,null,null,null,null,null,null,null,null,null,null,0,null,null,null,null,null,null,null,null,null,null,null,null,null,null,null,null,null,null,null,null,null,15,29]
[null,null,{"$f":"IF('Naudas plūsma 1. gads'!D22=\"\",\"\",'Naudas plūsma 1. gads'!D22)","v":""},{"$f":"'Naudas plūsma 1. gads'!E22","v":0.21},null,null,null,null,null,null,null,null,null,null,null,null,null,0,null,null,null,null,null,null,null,null,null,null,null,null,null,null,null,null,null,null,null,null,null,16,30]
[null,null,{"$f":"IF('Naudas plūsma 1. gads'!D23=\"\",\"\",'Naudas plūsma 1. gads'!D23)","v":""},{"$f":"'Naudas plūsma 1. gads'!E23","v":0.21},null,null,null,null,null,null,null,null,null,null,null,null,null,0,null,null,null,null,null,null,null,null,null,null,null,null,null,null,null,null,null,null,null,null,null,17,31]
[null,null,null,"Kopā",{"$f":"SUM(E12:E22)","v":0},{"$f":"SUM(F12:F22)","v":0},0,0,0,0,0,0,0,0,0,0,null,{"$f":"SUM(R12:R22)","v":0},null,null,null,null,null,null,null,null,null,null,null,null,null,null,null,null,null,null,null,null,null,18,32]
[null,null,"Citi ieņēmumi"]
[null,null,{"$f":"IF('Naudas plūsma 1. gads'!D26=\"\",\"\",'Naudas plūsma 1. gads'!D26)","v":"Saņemtie īstermiņa Aizdevēja* aizdevumi"},{"$f":"'Naudas plūsma 1. gads'!E26","v":0},null,null,null,null,null,null,null,null,null,null,null,null,null,{"$f":"SUM(E25:P25)","v":0},null,null,null,null,null,null,null,null,null,null,null,null,null,null,null,null,null,null,null,null,null,19,33]
[null,null,{"$f":"IF('Naudas plūsma 1. gads'!D27=\"\",\"\",'Naudas plūsma 1. gads'!D27)","v":"Saņemtie ilgtermiņa Aizdevēja* aizdevumi"},{"$f":"'Naudas plūsma 1. gads'!E27","v":0},null,null,null,null,null,null,null,null,null,null,null,null,null,{"$f":"SUM(E26:P26)","v":0},null,null,null,null,null,null,null,null,null,null,null,null,null,null,null,null,null,null,null,null,null,20,34]
[null,null,{"$f":"IF('Naudas plūsma 1. gads'!D28=\"\",\"\",'Naudas plūsma 1. gads'!D28)","v":"Ārkārtas ieņēmumi"},{"$f":"'Naudas plūsma 1. gads'!E28","v":0.21},null,null,null,null,null,null,null,null,null,null,null,null,null,0,null,null,null,null,null,null,null,null,null,null,null,null,null,null,null,null,null,null,null,null,null,21,35]
[null,null,{"$f":"IF('Naudas plūsma 1. gads'!D29=\"\",\"\",'Naudas plūsma 1. gads'!D29)","v":""},{"$f":"'Naudas plūsma 1. gads'!E29","v":0.21},null,null,null,null,null,null,null,null,null,null,null,null,null,0,null,null,null,null,null,null,null,null,null,null,null,null,null,null,null,null,null,null,null,null,null,22,36]
[null,null,{"$f":"IF('Naudas plūsma 1. gads'!D30=\"\",\"\",'Naudas plūsma 1. gads'!D30)","v":""},{"$f":"'Naudas plūsma 1. gads'!E30","v":0.21},null,null,null,null,null,null,null,null,null,null,null,null,null,0,null,null,null,null,null,null,null,null,null,null,null,null,null,null,null,null,null,null,null,null,null,23,37]
[null,null,null,"Saņemtais PVN",{"$f":"($D$8*E8)+($D$9*E9)+($D$12*E12)+($D$13*E13)+($D$14*E14)+($D$15*E15)+($D$16*E16)+($D$17*E17)+($D$18*E18)+($D$19*E19)+($D$20*E20)+($D$21*E21)+($D$22*E22)+($D$25*E25)+($D$26*E26)+($D$27*E27)+($D$28*E28)+($D$29*E29)","v":0},{"$f":"($D$8*F8)+($D$9*F9)+($D$12*F12)+($D$13*F13)+($D$14*F14)+($D$15*F15)+($D$16*F16)+($D$17*F17)+($D$18*F18)+($D$19*F19)+($D$20*F20)+($D$21*F21)+($D$22*F22)+($D$25*F25)+($D$26*F26)+($D$27*F27)+($D$28*F28)+($D$29*F29)","v":0},0,0,0,0,0,0,0,0,0,0,null,0,null,null,null,null,null,null,null,null,null,null,null,null,null,null,null,null,null,null,null,null,null,24,38]
[null,null,null,"Kopējie ieņēmumi",{"$f":"E10+E23+SUM(E25:E30)","v":0},{"$f":"F10+F23+SUM(F25:F30)","v":0},0,0,0,0,0,0,0,0,0,0,null,{"$f":"SUM(R8:R9,R23,R25:R30)","v":0},null,null,null,null,null,null,null,null,null,null,null,null,null,null,null,null,null,null,null,null,null,25,39]
[null,"Izdevumi, EUR",null,null,null,null,null,null,null,null,null,null,null,null,null,null,null,null,null,null,null,null,null,null,null,null,null,null,null,null,null,null,null,null,null,null,null,null,null,26,40]
[null,null,"Mainīgās izmaksas",null,{"$f":"E5","v":"okt"},{"$f":"F5","v":"nov"},"dec","jan","feb","mar","apr","mai","jūn","jūl","aug","sep",null,"Kopā"]
[null,null,{"$f":"IF('Naudas plūsma 1. gads'!D35=\"\",\"\",'Naudas plūsma 1. gads'!D35)","v":"Gaidāmie maksājumi"},{"$f":"'Naudas plūsma 1. gads'!E35","v":0.21},null,null,null,null,null,null,null,null,null,null,null,null,null,{"$f":"SUM(E34:P34)","v":0},null,null,null,null,null,null,null,null,null,null,null,null,null,null,null,null,null,null,null,null,null,27,42]
[]
[null,null,{"$f":"IF('Naudas plūsma 1. gads'!D37=\"\",\"\",'Naudas plūsma 1. gads'!D37)","v":"Izejmateriāli"},{"$f":"'Naudas plūsma 1. gads'!E37","v":0.21},null,null,null,null,null,null,null,null,null,null,null,null,null,0,null,null,null,null,null,null,null,null,null,null,null,null,null,null,null,null,null,null,null,null,null,28,43]
[null,null,{"$f":"IF('Naudas plūsma 1. gads'!D38=\"\",\"\",'Naudas plūsma 1. gads'!D38)","v":"Palīgmateriāli"},{"$f":"'Naudas plūsma 1. gads'!E38","v":0.21},null,null,null,null,null,null,null,null,null,null,null,null,null,0,null,null,null,null,null,null,null,null,null,null,null,null,null,null,null,null,null,null,null,null,null,29,44]
[null,null,{"$f":"IF('Naudas plūsma 1. gads'!D39=\"\",\"\",'Naudas plūsma 1. gads'!D39)","v":"Ražošanā strādājošo darba alga un sociālais nodoklis"},{"$f":"'Naudas plūsma 1. gads'!E39","v":0},null,null,null,null,null,null,null,null,null,null,null,null,null,0,null,null,null,null,null,null,null,null,null,null,null,null,null,null,null,null,null,null,null,null,null,30,45]
[null,null,{"$f":"IF('Naudas plūsma 1. gads'!D40=\"\",\"\",'Naudas plūsma 1. gads'!D40)","v":"Energoresursi"},{"$f":"'Naudas plūsma 1. gads'!E40","v":0.21},null,null,null,null,null,null,null,null,null,null,null,null,null,0,null,null,null,null,null,null,null,null,null,null,null,null,null,null,null,null,null,null,null,null,null,31,46]
[null,null,{"$f":"IF('Naudas plūsma 1. gads'!D41=\"\",\"\",'Naudas plūsma 1. gads'!D41)","v":"Realizācijas izmaksas"},{"$f":"'Naudas plūsma 1. gads'!E41","v":0.21},null,null,null,null,null,null,null,null,null,null,null,null,null,0,null,null,null,null,null,null,null,null,null,null,null,null,null,null,null,null,null,null,null,null,null,32,47]
{"$rows_left_out":46}